Project

General

Profile

Bug #4183

Updated by osmith over 3 years ago

 
 Visit https://build.opensuse.org/package/live_build_log/network:osmocom:nightly/osmo-gsm-manuals/Debian_Unstable/x86_64 
 https://build.opensuse.org/package/live_build_log/network:osmocom:nightly/osmo-gsm-manuals/Debian_Unstable 
 /x86_64 

 Package network:osmocom:nightly/osmo-gsm-manuals failed to build in Debian_Unstable/x86_64 

 Check out the package for editing: 
   osc checkout network:osmocom:nightly osmo-gsm-manuals 

 Last lines of build log: 
 <pre> 
 [    564s] asciidoc: test-usermanual.adoc: line 28: reading: 
 /usr/src/packages/BUILD/common/chapters/gfdl.adoc 
 [    564s] asciidoc: include: /usr/src/packages/BUILD/common/chapters/smpp.adoc 
 [    565s] asciidoc: test-usermanual.adoc: line 29: reading: 
 /usr/src/packages/BUILD/common/chapters/smpp.adoc 
 [    565s] asciidoc: include: /usr/src/packages/BUILD/common/chapters/sigtran.adoc 
 [    565s] asciidoc: test-usermanual.adoc: line 30: reading: 
 /usr/src/packages/BUILD/common/chapters/sigtran.adoc 
 [    565s] asciidoc: include: /usr/src/packages/BUILD/common/chapters/mncc.adoc 
 [    565s] asciidoc: test-usermanual.adoc: line 31: reading: 
 /usr/src/packages/BUILD/common/chapters/mncc.adoc 
 [    565s] asciidoc: include: /usr/src/packages/BUILD/common/chapters/abis.adoc 
 [    565s] asciidoc: test-usermanual.adoc: line 32: reading: 
 /usr/src/packages/BUILD/common/chapters/abis.adoc 
 [    565s] 
 [    565s] make[3]: *** [../build/Makefile.asciidoc.inc:69: test-usermanual.pdf] Error 1 
 [    565s] make[3]: Leaving directory '/usr/src/packages/BUILD/tests' 
 [    565s] make[2]: *** [Makefile:438: all-recursive] Error 1 
 [    565s] make[2]: Leaving directory '/usr/src/packages/BUILD' 
 [    565s] make[1]: *** [Makefile:362: all] Error 2 
 [    565s] make[1]: Leaving directory '/usr/src/packages/BUILD' 
 [    565s] dh_auto_build: make -j1 returned exit code 2 
 [    565s] make: *** [debian/rules:5: binary] Error 255 
 [    565s] dpkg-buildpackage: error: fakeroot debian/rules binary subprocess returned exit status 2 
 [    565s] 
 [    565s] lamb59 failed "build osmo-gsm-manuals-dev_0.2.0.dsc" at Fri Aug 30 02:37:43 UTC 2019. 
 [    565s] 
 [    565s] ### VM INTERACTION START ### 
 [    568s] [    543.931958] sysrq: SysRq : Power Off 
 [    568s] [    543.947767] reboot: Power down 
 [    568s] ### VM INTERACTION END ### 
 [    568s] 
 [    568s] lamb59 failed "build osmo-gsm-manuals-dev_0.2.0.dsc" at Fri Aug 30 02:37:47 UTC 2019. 
 [    568s] 
 </pre>

Back

Add picture from clipboard (Maximum size: 48.8 MB)